#
closed
Not working on iOS

When I try to run the Prokit on my macbook pro with iOS this is the error I get. 

Launching lib/main.dart on iPhone 11 Pro Max in debug mode...
Running Xcode build...
Xcode build done.                                           30.6s
Failed to build iOS app
Error output from Xcode build:
↳
    ** BUILD FAILED **


Xcode's output:
↳
    In file included from /Users/simondziak/Developer/flutter/.pub-cache/hosted/pub.dartlang.org/google_maps_flutter-0.5.21+3/ios/Classes/GoogleMapsPlugin.m:5:
    In file included from /Users/simondziak/Developer/flutter/.pub-cache/hosted/pub.dartlang.org/google_maps_flutter-0.5.21+3/ios/Classes/GoogleMapsPlugin.h:8:
    /Users/simondziak/Developer/flutter/.pub-cache/hosted/pub.dartlang.org/google_maps_flutter-0.5.21+3/ios/Classes/GoogleMapController.h:28:46: warning: pointer is missing a nullability type specifier (_Nonnull, _Nullable, or _Null_unspecified) [-Wnullability-completeness]
    - (NSString *_Nullable)setMapStyle:(NSString *)mapStyle;
                                                 ^
    /Users/simondziak/Developer/flutter/.pub-cache/hosted/pub.dartlang.org/google_maps_flutter-0.5.21+3/ios/Classes/GoogleMapController.h:28:46: note: insert '_Nullable' if the pointer may be null
    - (NSString *_Nullable)setMapStyle:(NSString *)mapStyle;
                                                 ^
                                                  _Nullable
    /Users/simondziak/Developer/flutter/.pub-cache/hosted/pub.dartlang.org/google_maps_flutter-0.5.21+3/ios/Classes/GoogleMapController.h:28:46: note: insert '_Nonnull' if the pointer should never be null
    - (NSString *_Nullable)setMapStyle:(NSString *)mapStyle;
                                                 ^
                                                  _Nonnull
    /Users/simondziak/Developer/flutter/.pub-cache/hosted/pub.dartlang.org/google_maps_flutter-0.5.21+3/ios/Classes/GoogleMapController.h:47:4: warning: pointer is missing a nullability type specifier (_Nonnull, _Nullable, or _Null_unspecified) [-Wnullability-completeness]
    - (instancetype)initWithRegistrar:(NSObject<FlutterPluginRegistrar> *_Nullable)registrar;
       ^
    /Users/simondziak/Developer/flutter/.pub-cache/hosted/pub.dartlang.org/google_maps_flutter-0.5.21+3/ios/Classes/GoogleMapController.h:47:4: note: insert '_Nullable' if the pointer may be null
    - (instancetype)initWithRegistrar:(NSObject<FlutterPluginRegistrar> *_Nullable)registrar;
       ^
                    _Nullable 
    /Users/simondziak/Developer/flutter/.pub-cache/hosted/pub.dartlang.org/google_maps_flutter-0.5.21+3/ios/Classes/GoogleMapController.h:47:4: note: insert '_Nonnull' if the pointer should never be null
    - (instancetype)initWithRegistrar:(NSObject<FlutterPluginRegistrar> *_Nullable)registrar;
       ^
                    _Nonnull 
    2 warnings generated.
    2 warnings generated.
    2 warnings generated.
    In file included from /Users/simondziak/Developer/flutter/.pub-cache/hosted/pub.dartlang.org/fluttertoast-4.0.1/ios/Classes/UIView+Toast.m:26:
    /Users/simondziak/Developer/flutter/.pub-cache/hosted/pub.dartlang.org/fluttertoast-4.0.1/ios/Classes/UIView+Toast.h:328:19: warning: empty paragraph passed to '@param' command [-Wdocumentation]
     @param sharedStyle
     ~~~~~~~~~~~~~~~~~^
    /Users/simondziak/Developer/flutter/.pub-cache/hosted/pub.dartlang.org/fluttertoast-4.0.1/ios/Classes/UIView+Toast.h:343:25: warning: empty paragraph passed to '@param' command [-Wdocumentation]
     @param allowTapToDismiss
     ~~~~~~~~~~~~~~~~~~~~~~~^
    /Users/simondziak/Developer/flutter/.pub-cache/hosted/pub.dartlang.org/fluttertoast-4.0.1/ios/Classes/UIView+Toast.h:343:9: warning: parameter 'allowTapToDismiss' not found in the function declaration [-Wdocumentation]
     @param allowTapToDismiss
            ^~~~~~~~~~~~~~~~~
    /Users/simondziak/Developer/flutter/.pub-cache/hosted/pub.dartlang.org/fluttertoast-4.0.1/ios/Classes/UIView+Toast.h:343:9: note: did you mean 'tapToDismissEnabled'?
     @param allowTapToDismiss
            ^~~~~~~~~~~~~~~~~
            tapToDismissEnabled
    /Users/simondziak/Developer/flutter/.pub-cache/hosted/pub.dartlang.org/fluttertoast-4.0.1/ios/Classes/UIView+Toast.h:362:20: warning: empty paragraph passed to '@param' command [-Wdocumentation]
     @param queueEnabled
     ~~~~~~~~~~~~~~~~~~^
    4 warnings generated.
    In file included from /Users/simondziak/Developer/flutter/.pub-cache/hosted/pub.dartlang.org/fluttertoast-4.0.1/ios/Classes/FluttertoastPlugin.m:2:
    /Users/simondziak/Developer/flutter/.pub-cache/hosted/pub.dartlang.org/fluttertoast-4.0.1/ios/Classes/UIView+Toast.h:328:19: warning: empty paragraph passed to '@param' command [-Wdocumentation]
     @param sharedStyle
     ~~~~~~~~~~~~~~~~~^
    /Users/simondziak/Developer/flutter/.pub-cache/hosted/pub.dartlang.org/fluttertoast-4.0.1/ios/Classes/UIView+Toast.h:343:25: warning: empty paragraph passed to '@param' command [-Wdocumentation]
     @param allowTapToDismiss
     ~~~~~~~~~~~~~~~~~~~~~~~^
    /Users/simondziak/Developer/flutter/.pub-cache/hosted/pub.dartlang.org/fluttertoast-4.0.1/ios/Classes/UIView+Toast.h:343:9: warning: parameter 'allowTapToDismiss' not found in the function declaration [-Wdocumentation]
     @param allowTapToDismiss
            ^~~~~~~~~~~~~~~~~
    /Users/simondziak/Developer/flutter/.pub-cache/hosted/pub.dartlang.org/fluttertoast-4.0.1/ios/Classes/UIView+Toast.h:343:9: note: did you mean 'tapToDismissEnabled'?
     @param allowTapToDismiss
            ^~~~~~~~~~~~~~~~~
            tapToDismissEnabled
    /Users/simondziak/Developer/flutter/.pub-cache/hosted/pub.dartlang.org/fluttertoast-4.0.1/ios/Classes/UIView+Toast.h:362:20: warning: empty paragraph passed to '@param' command [-Wdocumentation]
     @param queueEnabled
     ~~~~~~~~~~~~~~~~~~^
    /Users/simondziak/Developer/flutter/.pub-cache/hosted/pub.dartlang.org/fluttertoast-4.0.1/ios/Classes/FluttertoastPlugin.m:19:23: warning: unused variable 'viewController' [-Wunused-variable]
        UIViewController *viewController =
                          ^
    /Users/simondziak/Developer/flutter/.pub-cache/hosted/pub.dartlang.org/fluttertoast-4.0.1/ios/Classes/FluttertoastPlugin.m:70:21: warning: unused variable 'topPadding' [-Wunused-variable]
                CGFloat topPadding = window.safeAreaInsets.top;
                        ^
    /Users/simondziak/Developer/flutter/.pub-cache/hosted/pub.dartlang.org/fluttertoast-4.0.1/ios/Classes/FluttertoastPlugin.m:71:21: warning: unused variable 'bottomPadding' [-Wunused-variable]
                CGFloat bottomPadding = window.safeAreaInsets.bottom;
                        ^
    /Users/simondziak/Developer/flutter/.pub-cache/hosted/pub.dartlang.org/fluttertoast-4.0.1/ios/Classes/FluttertoastPlugin.m:48:19: warning: unused variable 'size' [-Wunused-variable]
            NSNumber *size = call.arguments[@"size"];
                      ^
    8 warnings generated.
    /Users/simondziak/Developer/flutter/.pub-cache/hosted/pub.dartlang.org/firebase_analytics-5.0.16/ios/Classes/FLTFirebaseAnalyticsPlugin.m:56:19: warning: 'setScreenName:screenClass:' is deprecated: Use +[FIRAnalytics logEventWithName:kFIREventScreenView parameters:] instead. [-Wdeprecated-declarations]
        [FIRAnalytics setScreenName:screenName screenClass:screenClassOverride];
                      ^
    In module 'FirebaseAnalytics' imported from /Users/simondziak/AndroidStudioProjects/jeff420chef_app/ios/Pods/Headers/Public/Firebase/Firebase.h:29:
    /Users/simondziak/AndroidStudioProjects/jeff420chef_app/ios/Pods/FirebaseAnalytics/Frameworks/FirebaseAnalytics.framework/Headers/FIRAnalytics.h:114:5: note: 'setScreenName:screenClass:' has been explicitly marked deprecated here
        DEPRECATED_MSG_ATTRIBUTE(
        ^
    In module 'UIKit' imported from /Users/simondziak/AndroidStudioProjects/jeff420chef_app/ios/Pods/Target Support Files/firebase_analytics/firebase_analytics-prefix.pch:2:
    In module 'Foundation' imported from /Applications/Xcode.app/Contents/Developer/Platforms/iPhoneSimulator.platform/Developer/SDKs/iPhoneSimulator13.6.sdk/System/Library/Frameworks/UIKit.framework/Headers/UIKit.h:8:
    In module 'CoreFoundation' imported from /Applications/Xcode.app/Contents/Developer/Platforms/iPhoneSimulator.platform/Developer/SDKs/iPhoneSimulator13.6.sdk/System/Library/Frameworks/Foundation.framework/Headers/Foundation.h:6:
    In module 'Darwin' imported from /Applications/Xcode.app/Contents/Developer/Platforms/iPhoneSimulator.platform/Developer/SDKs/iPhoneSimulator13.6.sdk/System/Library/Frameworks/CoreFoundation.framework/Headers/CoreFoundation.h:16:
    /Applications/Xcode.app/Contents/Developer/Platforms/iPhoneSimulator.platform/Developer/SDKs/iPhoneSimulator13.6.sdk/usr/include/AvailabilityMacros.h:182:64: note: expanded from macro 'DEPRECATED_MSG_ATTRIBUTE'
                #define DEPRECATED_MSG_ATTRIBUTE(s) __attribute__((deprecated(s)))
                                                                   ^
    1 warning generated.
    While building module 'google_maps_flutter' imported from /Users/simondziak/AndroidStudioProjects/jeff420chef_app/ios/Runner/GeneratedPluginRegistrant.m:56:
    In file included from <module-includes>:1:
    In file included from /Users/simondziak/AndroidStudioProjects/jeff420chef_app/build/ios/Debug-iphonesimulator/google_maps_flutter/google_maps_flutter.framework/Headers/google_maps_flutter-umbrella.h:14:
    /Users/simondziak/AndroidStudioProjects/jeff420chef_app/build/ios/Debug-iphonesimulator/google_maps_flutter/google_maps_flutter.framework/Headers/GoogleMapController.h:28:46: warning: pointer is missing a nullability type specifier (_Nonnull, _Nullable, or _Null_unspecified) [-Wnullability-completeness]
    - (NSString *_Nullable)setMapStyle:(NSString *)mapStyle;
                                                 ^
    /Users/simondziak/AndroidStudioProjects/jeff420chef_app/build/ios/Debug-iphonesimulator/google_maps_flutter/google_maps_flutter.framework/Headers/GoogleMapController.h:28:46: note: insert '_Nullable' if the pointer may be null
    - (NSString *_Nullable)setMapStyle:(NSString *)mapStyle;
                                                 ^
                                                  _Nullable
    /Users/simondziak/AndroidStudioProjects/jeff420chef_app/build/ios/Debug-iphonesimulator/google_maps_flutter/google_maps_flutter.framework/Headers/GoogleMapController.h:28:46: note: insert '_Nonnull' if the pointer should never be null
    - (NSString *_Nullable)setMapStyle:(NSString *)mapStyle;
                                                 ^
                                                  _Nonnull
    /Users/simondziak/AndroidStudioProjects/jeff420chef_app/build/ios/Debug-iphonesimulator/google_maps_flutter/google_maps_flutter.framework/Headers/GoogleMapController.h:47:4: warning: pointer is missing a nullability type specifier (_Nonnull, _Nullable, or _Null_unspecified) [-Wnullability-completeness]
    - (instancetype)initWithRegistrar:(NSObject<FlutterPluginRegistrar> *_Nullable)registrar;
       ^
    /Users/simondziak/AndroidStudioProjects/jeff420chef_app/build/ios/Debug-iphonesimulator/google_maps_flutter/google_maps_flutter.framework/Headers/GoogleMapController.h:47:4: note: insert '_Nullable' if the pointer may be null
    - (instancetype)initWithRegistrar:(NSObject<FlutterPluginRegistrar> *_Nullable)registrar;
       ^
                    _Nullable 
    /Users/simondziak/AndroidStudioProjects/jeff420chef_app/build/ios/Debug-iphonesimulator/google_maps_flutter/google_maps_flutter.framework/Headers/GoogleMapController.h:47:4: note: insert '_Nonnull' if the pointer should never be null
    - (instancetype)initWithRegistrar:(NSObject<FlutterPluginRegistrar> *_Nullable)registrar;
       ^
                    _Nonnull 
    2 warnings generated.
    2 warnings generated.
    ld: targeted OS version does not support use of thread local variables in __ZN9GMSx_absl9GMSx_Cord9InlineRep10AppendTreeEPNS_13cord_internal12GMSx_CordRepE for architecture x86_64
    clang: error: linker command failed with exit code 1 (use -v to see invocation)
    note: Using new build system
    note: Building targets in parallel
    note: Planning build
    note: Constructing build description
    warning: Capabilities for Signing & Capabilities may not function correctly because its entitlements use a placeholder team ID. To resolve this, select a development team in the Runner editor. (in target 'Runner' from project 'Runner')

Could not build the application for the simulator.
Error launching application on iPhone 11 Pro Max.

Asked 10 months ago on July 28, 2020 6:54 PM Comments 2 times


  1. Generic placeholder image

    Admin replied

    Hello,

    We have provided update on codecanyon. download latest update from thair.

    Thanks have a nice day :)

  2. Generic placeholder image

    Sandy replied

    Hello Simon Dziak,
    We will check and let you know.
    Thanks

     

Recent Tickets
erro doctor - Select Clin... 3 months ago on February 22, 2021 8:25 PM NotePlus change default v... 3 months ago on February 19, 2021 10:02 PM [ERROR] Failed to import ... 9 months ago on August 22, 2020 7:19 AM Stripe Android SDK Error... 1 day ago on June 14, 2021 10:31 AM How to increase App ICON ... 3 days ago on June 12, 2021 3:15 PM TV Shows not showing cate... 4 days ago on June 11, 2021 4:34 PM Newz - Flutter 2.0 News &... 4 days ago on June 11, 2021 2:27 PM website does not loading... 4 days ago on June 11, 2021 11:44 AM version with support for ... 5 days ago on June 10, 2021 2:37 PM Multisite, Language Trans... 5 days ago on June 10, 2021 8:37 AM